Reaction Details
TargetSphingosine 1-phosphate receptor 5
LigandBDBM50209069
Substrate/Competitorn/a
Meas. Tech.ChEMBL_1633656 (CHEMBL3876448)
EC50 143±n/a nM
Citation Hur, WRosen, HGray, NS A benzo[b]thiophene-based selective type 4 S1P receptor agonist. Bioorg Med Chem Lett27:1-5 (2017) 
 
Sphingosine 1-phosphate receptor 5
Name:Sphingosine 1-phosphate receptor 5
Type:G Protein-Coupled Receptor (GPCR)
Mol. Mass.:41796.42
Organism:Homo sapiens (Human)
Description:n/a
Residue:398
BDBM50209069
NameBDBM50209069
Synonyms:CHEMBL3883377
TypeSmall organic molecule
Emp. Form.C23H21NO2S
Mol. Mass.375.483
SMILESOC(=O)CCCNCc1cc2cc(ccc2s1)-c1ccc2ccccc2c1