Reaction Details
TargetSphingosine 1-phosphate receptor 3
LigandBDBM50209070
Substrate/Competitorn/a
Meas. Tech.ChEMBL_1633661 (CHEMBL3876453)
EC50>100000±n/a nM
Citation Hur, WRosen, HGray, NS A benzo[b]thiophene-based selective type 4 S1P receptor agonist. Bioorg Med Chem Lett27:1-5 (2017) 
 
Sphingosine 1-phosphate receptor 3
Name:Sphingosine 1-phosphate receptor 3
Type:G Protein-Coupled Receptor (GPCR)
Mol. Mass.:42278.13
Organism:Homo sapiens (Human)
Description:Q99500
Residue:378
BDBM50209070
NameBDBM50209070
Synonyms:CHEMBL3883572
TypeSmall organic molecule
Emp. Form.C24H23NO2S
Mol. Mass.389.51
SMILESOC(=O)CCCCNCc1cc2c(cccc2s1)-c1ccc2ccccc2c1