Reaction Details
TargetSphingosine 1-phosphate receptor 4
LigandBDBM50209056
Substrate/Competitorn/a
Meas. Tech.ChEMBL_1633657 (CHEMBL3876449)
EC50 187±n/a nM
Citation Hur, WRosen, HGray, NS A benzo[b]thiophene-based selective type 4 S1P receptor agonist. Bioorg Med Chem Lett27:1-5 (2017) 
 
Sphingosine 1-phosphate receptor 4
Name:Sphingosine 1-phosphate receptor 4
Type:G Protein-Coupled Receptor (GPCR)
Mol. Mass.:41647.39
Organism:Homo sapiens (Human)
Description:n/a
Residue:384
BDBM50209056
NameBDBM50209056
Synonyms:CHEMBL3883456
TypeSmall organic molecule
Emp. Form.C22H19NO2S
Mol. Mass.361.457
SMILESOC(=O)CCNCc1cc2cccc(-c3ccc4ccccc4c3)c2s1