Reaction Details
TargetSphingosine 1-phosphate receptor 5
LigandBDBM50209037
Substrate/Competitorn/a
Meas. Tech.ChEMBL_1633656 (CHEMBL3876448)
EC50 21200±n/a nM
Citation Hur, WRosen, HGray, NS A benzo[b]thiophene-based selective type 4 S1P receptor agonist. Bioorg Med Chem Lett27:1-5 (2017) 
 
Sphingosine 1-phosphate receptor 5
Name:Sphingosine 1-phosphate receptor 5
Type:G Protein-Coupled Receptor (GPCR)
Mol. Mass.:41796.42
Organism:Homo sapiens (Human)
Description:n/a
Residue:398
BDBM50209037
NameBDBM50209037
Synonyms:CHEMBL3883646
TypeSmall organic molecule
Emp. Form.C21H21NO2S
Mol. Mass.351.462
SMILESCCc1ccccc1-c1cccc2sc(CN3CC(C3)C(O)=O)cc12