Reaction Details
TargetSphingosine 1-phosphate receptor 2
LigandBDBM50209035
Substrate/Competitorn/a
Meas. Tech.ChEMBL_1633660 (CHEMBL3876452)
EC50>100000±n/a nM
Citation Hur, WRosen, HGray, NS A benzo[b]thiophene-based selective type 4 S1P receptor agonist. Bioorg Med Chem Lett27:1-5 (2017) 
 
Sphingosine 1-phosphate receptor 2
Name:Sphingosine 1-phosphate receptor 2
Type:G Protein-Coupled Receptor (GPCR)
Mol. Mass.:38883.16
Organism:Homo sapiens (Human)
Description:Membranes isolated from S1P2-transfected CHO cells were used in ligand binding assay.
Residue:353
BDBM50209035
NameBDBM50209035
Synonyms:CHEMBL3883447
TypeSmall organic molecule
Emp. Form.C21H17NO2S
Mol. Mass.347.43
SMILESOC(=O)CNCc1cc2c(cccc2s1)-c1ccc2ccccc2c1