Reaction Details
TargetSphingosine 1-phosphate receptor 5
LigandBDBM50209033
Substrate/Competitorn/a
Meas. Tech.ChEMBL_1633656 (CHEMBL3876448)
EC50 552±n/a nM
Citation Hur, WRosen, HGray, NS A benzo[b]thiophene-based selective type 4 S1P receptor agonist. Bioorg Med Chem Lett27:1-5 (2017) 
 
Sphingosine 1-phosphate receptor 5
Name:Sphingosine 1-phosphate receptor 5
Type:G Protein-Coupled Receptor (GPCR)
Mol. Mass.:41796.42
Organism:Homo sapiens (Human)
Description:n/a
Residue:398
BDBM50209033
NameBDBM50209033
Synonyms:CHEMBL3884795
TypeSmall organic molecule
Emp. Form.C20H18F3NO2S
Mol. Mass.393.423
SMILESOC(=O)CCCNCc1cc2cccc(-c3ccc(cc3)C(F)(F)F)c2s1