Reaction Details
TargetSphingosine 1-phosphate receptor 5
LigandBDBM50209058
Substrate/Competitorn/a
Meas. Tech.ChEMBL_1633656 (CHEMBL3876448)
EC50>100000±n/a nM
Citation Hur, WRosen, HGray, NS A benzo[b]thiophene-based selective type 4 S1P receptor agonist. Bioorg Med Chem Lett27:1-5 (2017) 
 
Sphingosine 1-phosphate receptor 5
Name:Sphingosine 1-phosphate receptor 5
Type:G Protein-Coupled Receptor (GPCR)
Mol. Mass.:41796.42
Organism:Homo sapiens (Human)
Description:n/a
Residue:398
BDBM50209058
NameBDBM50209058
Synonyms:CHEMBL3885034
TypeSmall organic molecule
Emp. Form.C20H21NO2S
Mol. Mass.339.451
SMILESCCc1ccccc1-c1cccc2sc(CNCCC(O)=O)cc12