Reaction Details
TargetSphingosine 1-phosphate receptor 4
LigandBDBM50209075
Substrate/Competitorn/a
Meas. Tech.ChEMBL_1633657 (CHEMBL3876449)
EC50 10300±n/a nM
Citation Hur, WRosen, HGray, NS A benzo[b]thiophene-based selective type 4 S1P receptor agonist. Bioorg Med Chem Lett27:1-5 (2017) 
 
Sphingosine 1-phosphate receptor 4
Name:Sphingosine 1-phosphate receptor 4
Type:G Protein-Coupled Receptor (GPCR)
Mol. Mass.:41647.39
Organism:Homo sapiens (Human)
Description:n/a
Residue:384
BDBM50209075
NameBDBM50209075
Synonyms:CHEMBL3883549
TypeSmall organic molecule
Emp. Form.C21H23NO2S
Mol. Mass.353.478
SMILESCCc1ccccc1-c1cccc2sc(CNCC(C)C(O)=O)cc12