Reaction Details
TargetSphingosine 1-phosphate receptor 5
LigandBDBM50209073
Substrate/Competitorn/a
Meas. Tech.ChEMBL_1633656 (CHEMBL3876448)
EC50 412±n/a nM
Citation Hur, WRosen, HGray, NS A benzo[b]thiophene-based selective type 4 S1P receptor agonist. Bioorg Med Chem Lett27:1-5 (2017) 
 
Sphingosine 1-phosphate receptor 5
Name:Sphingosine 1-phosphate receptor 5
Type:G Protein-Coupled Receptor (GPCR)
Mol. Mass.:41796.42
Organism:Homo sapiens (Human)
Description:n/a
Residue:398
BDBM50209073
NameBDBM50209073
Synonyms:CHEMBL3883555
TypeSmall organic molecule
Emp. Form.C24H23NO2S
Mol. Mass.389.51
SMILESOC(=O)CCCCNCc1cc2cccc(-c3ccc4ccccc4c3)c2s1