Reaction Details
TargetMAP/microtubule affinity-regulating kinase 3
LigandBDBM50209094
Substrate/Competitorn/a
Meas. Tech.ChEMBL_1633686 (CHEMBL3876478)
IC50 1524±n/a nM
Citation Haidle, AMChilders, KKZabierek, AAKatz, JDJewell, JPHou, YAltman, MDSzewczak, AChen, DHarsch, AHayashi, MWarren, LHutton, MNuthall, HStanton, MGDavies, IWMunoz, BNorthrup, A MARK inhibitors: Declaring a No-Go decision on a chemical series based on extensive DMPK experimentation. Bioorg Med Chem Lett27:109-113 (2017) 
 
MAP/microtubule affinity-regulating kinase 3
Name:MAP/microtubule affinity-regulating kinase 3
Type:Protein
Mol. Mass.:84525.94
Organism:Homo sapiens (Human)
Description:P27448
Residue:753
BDBM50209094
NameBDBM50209094
Synonyms:CHEMBL3885321
TypeSmall organic molecule
Emp. Form.C21H20FN5O
Mol. Mass.377.4148
SMILESC[C@@H](N1C(=O)C(C)(C)c2cnc(Nc3cccnc3)nc12)c1ccc(F)cc1