Reaction Details
TargetMAP/microtubule affinity-regulating kinase 3
LigandBDBM50208912
Substrate/Competitorn/a
Meas. Tech.ChEMBL_1633686 (CHEMBL3876478)
IC50 738±n/a nM
Citation Haidle, AMChilders, KKZabierek, AAKatz, JDJewell, JPHou, YAltman, MDSzewczak, AChen, DHarsch, AHayashi, MWarren, LHutton, MNuthall, HStanton, MGDavies, IWMunoz, BNorthrup, A MARK inhibitors: Declaring a No-Go decision on a chemical series based on extensive DMPK experimentation. Bioorg Med Chem Lett27:109-113 (2017) 
 
MAP/microtubule affinity-regulating kinase 3
Name:MAP/microtubule affinity-regulating kinase 3
Type:Protein
Mol. Mass.:84525.94
Organism:Homo sapiens (Human)
Description:P27448
Residue:753
BDBM50208912
NameBDBM50208912
Synonyms:CHEMBL3883766
TypeSmall organic molecule
Emp. Form.C17H21N5O
Mol. Mass.311.3815
SMILESCC[C@@H](C)N1C(=O)C(C)(C)c2cnc(Nc3cccnc3)nc12