Reaction Details
TargetPhosphatidylinositol 4,5-bisphosphate 3-kinase catalytic subunit delta isoform
LigandBDBM50209502
Substrate/Competitorn/a
Meas. Tech.ChEMBL_1633813 (CHEMBL3876605)
IC50>1000±n/a nM
Citation Kendall, JDGiddens, ACTsang, KYMarshall, ESLill, CLLee, WJKolekar, SChao, MMalik, AYu, SChaussade, CBuchanan, CJamieson, SMFRewcastle, GWBaguley, BCDenny, WAShepherd, PR Novel pyrazolo[1,5-a]pyridines with improved aqueous solubility as p110a-selective PI3 kinase inhibitors. Bioorg Med Chem Lett27:187-190 (2017) 
 
Phosphatidylinositol 4,5-bisphosphate 3-kinase catalytic subunit delta isoform
Name:Phosphatidylinositol 4,5-bisphosphate 3-kinase catalytic subunit delta isoform
Type:Enzyme Subunit
Mol. Mass.:119489.41
Organism:Homo sapiens (Human)
Description:O00329
Residue:1044
BDBM50209502
NameBDBM50209502
Synonyms:CHEMBL3884541
TypeSmall organic molecule
Emp. Form.C20H21N7O5S
Mol. Mass.471.49
SMILESCN(C)CCOc1ccc(cc1S(=O)(=O)N(C)\N=C\c1cnn2ccc(cc12)C#N)[N+]([O-])=O