Reaction Details
TargetPhosphatidylinositol 4,5-bisphosphate 3-kinase catalytic subunit delta isoform
LigandBDBM50209312
Substrate/Competitorn/a
Meas. Tech.ChEMBL_1633813 (CHEMBL3876605)
IC50 676±n/a nM
Citation Kendall, JDGiddens, ACTsang, KYMarshall, ESLill, CLLee, WJKolekar, SChao, MMalik, AYu, SChaussade, CBuchanan, CJamieson, SMFRewcastle, GWBaguley, BCDenny, WAShepherd, PR Novel pyrazolo[1,5-a]pyridines with improved aqueous solubility as p110a-selective PI3 kinase inhibitors. Bioorg Med Chem Lett27:187-190 (2017) 
 
Phosphatidylinositol 4,5-bisphosphate 3-kinase catalytic subunit delta isoform
Name:Phosphatidylinositol 4,5-bisphosphate 3-kinase catalytic subunit delta isoform
Type:Enzyme Subunit
Mol. Mass.:119489.41
Organism:Homo sapiens (Human)
Description:O00329
Residue:1044
BDBM50209312
NameBDBM50209312
Synonyms:CHEMBL3885000
TypeSmall organic molecule
Emp. Form.C21H24N8O4S
Mol. Mass.484.531
SMILESCN(C)CCN(C)c1ccc(cc1S(=O)(=O)N\N=C(/C)c1cnn2ccc(cc12)C#N)[N+]([O-])=O