Reaction Details
Target5-hydroxytryptamine receptor 1A
LigandBDBM50098551
Substrate/Competitorn/a
Meas. Tech.ChEMBL_1634227 (CHEMBL3877019)
Ki 9024±n/a nM
Citation Intagliata, SModica, MNPittalą, VSalerno, LSiracusa, MACagnotto, ASalmona, MKurczab, RRomeo, G New N- and O-arylpiperazinylalkyl pyrimidines and 2-methylquinazolines derivatives as 5-HT Bioorg Med Chem25:1250-1259 (2017) 
 
5-hydroxytryptamine receptor 1A
Name:5-hydroxytryptamine receptor 1A
Type:n/a
Mol. Mass.:46122.49
Organism:Homo sapiens (Human)
Description:n/a
Residue:422
BDBM50098551
NameBDBM50098551
Synonyms:(R)-3-(2-(2-(4-methylpiperidin-1-yl)ethyl)pyrrolidin-1-ylsulfonyl)phenol 3-{(R)-2-[2-(4-Methyl-piperidin-1-yl)-ethyl]-pyrrolidine-1-sulfonyl}-phenol 3-{2-[2-(4-Methyl-piperidin-1-yl)-ethyl]-pyrrolidine-1-sulfonyl}-phenol CHEMBL282199 | SB-269970
TypeSmall organic molecule
Emp. Form.C18H28N2O3S
Mol. Mass.352.492
SMILESCC1CCN(CC[C@H]2CCCN2S(=O)(=O)c2cccc(O)c2)CC1