Reaction Details
TargetCarbonic anhydrase 2
LigandBDBM50209860
Substrate/Competitorn/a
Meas. Tech.ChEMBL_1634231 (CHEMBL3877023)
Ki 15±n/a nM
Citation Kumar, RBua, SRam, SDel Prete, SCapasso, CSupuran, CTSharma, PK Benzenesulfonamide bearing imidazothiadiazole and thiazolotriazole scaffolds as potent tumor associated human carbonic anhydrase IX and XII inhibitors. Bioorg Med Chem25:1286-1293 (2017) 
 
Carbonic anhydrase 2
Name:Carbonic anhydrase 2
Type:Enzyme
Mol. Mass.:29250.71
Organism:Homo sapiens (Human)
Description:P00918
Residue:260
BDBM50209860
NameBDBM50209860
Synonyms:CHEMBL3884722
TypeSmall organic molecule
Emp. Form.C17H14N4O3S2
Mol. Mass.386.448
SMILESCOc1ccc(cc1)-c1csc2nc(nn12)-c1ccc(cc1)S(N)(=O)=O