Reaction Details
TargetCarbonic anhydrase 1
LigandBDBM50209860
Substrate/Competitorn/a
Meas. Tech.ChEMBL_1634230 (CHEMBL3877022)
Ki 83±n/a nM
Citation Kumar, RBua, SRam, SDel Prete, SCapasso, CSupuran, CTSharma, PK Benzenesulfonamide bearing imidazothiadiazole and thiazolotriazole scaffolds as potent tumor associated human carbonic anhydrase IX and XII inhibitors. Bioorg Med Chem25:1286-1293 (2017) 
 
Carbonic anhydrase 1
Name:Carbonic anhydrase 1
Type:Enzyme
Mol. Mass.:28873.37
Organism:Homo sapiens (Human)
Description:P00915
Residue:261
BDBM50209860
NameBDBM50209860
Synonyms:CHEMBL3884722
TypeSmall organic molecule
Emp. Form.C17H14N4O3S2
Mol. Mass.386.448
SMILESCOc1ccc(cc1)-c1csc2nc(nn12)-c1ccc(cc1)S(N)(=O)=O