Reaction Details
TargetCarbonic anhydrase 2
LigandBDBM50209863
Substrate/Competitorn/a
Meas. Tech.ChEMBL_1634231 (CHEMBL3877023)
Ki 529±n/a nM
Citation Kumar, RBua, SRam, SDel Prete, SCapasso, CSupuran, CTSharma, PK Benzenesulfonamide bearing imidazothiadiazole and thiazolotriazole scaffolds as potent tumor associated human carbonic anhydrase IX and XII inhibitors. Bioorg Med Chem25:1286-1293 (2017) 
 
Carbonic anhydrase 2
Name:Carbonic anhydrase 2
Type:Enzyme
Mol. Mass.:29250.71
Organism:Homo sapiens (Human)
Description:P00918
Residue:260
BDBM50209863
NameBDBM50209863
Synonyms:CHEMBL3885020
TypeSmall organic molecule
Emp. Form.C16H11ClN4O2S2
Mol. Mass.390.867
SMILESNS(=O)(=O)c1ccc(cc1)-c1nc2scc(-c3ccc(Cl)cc3)n2n1