Reaction Details
TargetLysine-specific histone demethylase 1A
LigandBDBM50158884
Substrate/Competitorn/a
Meas. Tech.ChEMBL_1634250 (CHEMBL3877042)
Ki 1900±n/a nM
Citation Amano, YUmezawa, NSato, SWatanabe, HUmehara, THiguchi, T Activation of lysine-specific demethylase 1 inhibitor peptide by redox-controlled cleavage of a traceless linker. Bioorg Med Chem25:1227-1234 (2017) 
 
Lysine-specific histone demethylase 1A
Name:Lysine-specific histone demethylase 1A
Type:Enzyme
Mol. Mass.:92901.01
Organism:Homo sapiens (Human)
Description:O60341
Residue:852
BDBM50158884
NameBDBM50158884
Synonyms:CHEMBL3785550
TypeSmall organic molecule
Emp. Form.C51H87N17O10
Mol. Mass.1098.3444
SMILESCC(C)C[C@H](NC(=O)[C@H](Cc1ccccc1)NC(=O)[C@H](CO)NC(=O)[C@H](CCCNC(N)=N)NC(=O)[C@@H]1CCCN1)C(=O)N[C@@H](C(C)C)C(=O)N[C@@H](CCCNC(N)=N)C(=O)N[C@@H](CCCCN)C(=O)N1CCC[C@H]1C(N)=O