Reaction Details
TargetEstrogen receptor
LigandBDBM50210071
Substrate/Competitorn/a
Meas. Tech.ChEMBL_1634289 (CHEMBL3877081)
IC50 1.1±n/a nM
Citation Liu, JZheng, SGuo, SZhang, CZhong, QZhang, QMa, PSkripnikova, EVBratton, MRWiese, TEWang, G Rational Design of a Boron-Modified Triphenylethylene (GLL398) as an Oral Selective Estrogen Receptor Downregulator. ACS Med Chem Lett8:102-106 (2017) 
 
Estrogen receptor
Name:Estrogen receptor
Type:Protein
Mol. Mass.:66230.44
Organism:Homo sapiens (Human)
Description:P03372
Residue:595
BDBM50210071
NameBDBM50210071
Synonyms:CHEMBL3885342
TypeSmall organic molecule
Emp. Form.C25H23BO4
Mol. Mass.398.259
SMILESCCC(=C(c1ccc(\C=C\C(O)=O)cc1)c1ccc(cc1)B(O)O)c1ccccc1