Reaction Details
TargetBromodomain testis-specific protein
LigandBDBM50210164
Substrate/Competitorn/a
Meas. Tech.ChEMBL_1634390 (CHEMBL3877182)
IC50 110±n/a nM
Citation Munoz, L Non-kinase targets of protein kinase inhibitors. Nat Rev Drug Discov16:424-440 (2017) 
 
Bromodomain testis-specific protein
Name:Bromodomain testis-specific protein
Type:PROTEIN
Mol. Mass.:107982.01
Organism:Homo sapiens (Human)
Description:ChEMBL_1502985
Residue:947
BDBM50210164
NameBDBM50210164
Synonyms:CHEMBL2132936
TypeSmall organic molecule
Emp. Form.C23H25ClN4O2S
Mol. Mass.456.988
SMILESCc1nnc2C(CC(=O)OC(C)(C)C)N=C(c3c(C)c(C)sc3-n12)c1ccc(Cl)cc1