Reaction Details
TargetBromodomain-containing protein 4
LigandBDBM50210164
Substrate/Competitorn/a
Meas. Tech.ChEMBL_1634389 (CHEMBL3877181)
IC50 35±n/a nM
Citation Munoz, L Non-kinase targets of protein kinase inhibitors. Nat Rev Drug Discov16:424-440 (2017) 
 
Bromodomain-containing protein 4
Name:Bromodomain-containing protein 4
Type:Protein
Mol. Mass.:152264.84
Organism:Homo sapiens (Human)
Description:O60885
Residue:1362
BDBM50210164
NameBDBM50210164
Synonyms:CHEMBL2132936
TypeSmall organic molecule
Emp. Form.C23H25ClN4O2S
Mol. Mass.456.988
SMILESCc1nnc2C(CC(=O)OC(C)(C)C)N=C(c3c(C)c(C)sc3-n12)c1ccc(Cl)cc1