Reaction Details
TargetBromodomain-containing protein 4
LigandBDBM50402023
Substrate/Competitorn/a
Meas. Tech.ChEMBL_1634395 (CHEMBL3877187)
Kd 79±n/a nM
Citation Munoz, L Non-kinase targets of protein kinase inhibitors. Nat Rev Drug Discov16:424-440 (2017) 
 
Bromodomain-containing protein 4
Name:Bromodomain-containing protein 4
Type:Protein
Mol. Mass.:152264.84
Organism:Homo sapiens (Human)
Description:O60885
Residue:1362
BDBM50402023
NameBDBM50402023
Synonyms:BI 6727 | VOLASERTIB
TypeSmall organic molecule
Emp. Form.C34H50N8O3
Mol. Mass.618.8126
SMILESCC[C@H]1N(C(C)C)c2nc(Nc3ccc(cc3OC)C(=O)N[C@H]3CC[C@@H](CC3)N3CCN(CC4CC4)CC3)ncc2N(C)C1=O