Reaction Details
TargetHepatocyte growth factor receptor
LigandBDBM50146168
Substrate/Competitorn/a
Meas. Tech.ChEMBL_1634381 (CHEMBL3877173)
Ki 355±n/a nM
Citation Munoz, L Non-kinase targets of protein kinase inhibitors. Nat Rev Drug Discov16:424-440 (2017) 
 
Hepatocyte growth factor receptor
Name:Hepatocyte growth factor receptor
Type:Protein
Mol. Mass.:155559.73
Organism:Homo sapiens (Human)
Description:P08581
Residue:1390
BDBM50146168
NameBDBM50146168
Synonyms:ARQ-197 | Tivantinib
TypeSmall organic molecule
Emp. Form.C23H19N3O2
Mol. Mass.369.4159
SMILESO=C1NC(=O)[C@H]([C@@H]1c1c[nH]c2ccccc12)c1cn2CCCc3cccc1c23