Reaction Details
TargetCasein kinase I isoform delta
LigandBDBM50263829
Substrate/Competitorn/a
Meas. Tech.ChEMBL_1634382 (CHEMBL3877174)
IC50 1000±n/a nM
Citation Munoz, L Non-kinase targets of protein kinase inhibitors. Nat Rev Drug Discov16:424-440 (2017) 
 
Casein kinase I isoform delta
Name:Casein kinase I isoform delta
Type:Enzyme
Mol. Mass.:47356.76
Organism:Homo sapiens (Human)
Description:P48730
Residue:415
BDBM50263829
NameBDBM50263829
Synonyms:3-(2,4,6-Trimethoxybenzylidene)indolin-2-one 3-[(2,4,6-trimethoxyphenyl)methylidenyl]-indolin-2-one | CHEMBL489156
TypeSmall organic molecule
Emp. Form.C18H17NO4
Mol. Mass.311.3319
SMILESCOc1cc(OC)c(\C=C2\C(=O)Nc3ccccc23)c(OC)c1