Reaction Details
TargetBromodomain-containing protein 4
LigandBDBM50044784
Substrate/Competitorn/a
Meas. Tech.ChEMBL_1634403 (CHEMBL3877195)
IC50 2500±n/a nM
Citation Munoz, L Non-kinase targets of protein kinase inhibitors. Nat Rev Drug Discov16:424-440 (2017) 
 
Bromodomain-containing protein 4
Name:Bromodomain-containing protein 4
Type:Protein
Mol. Mass.:152264.84
Organism:Homo sapiens (Human)
Description:O60885
Residue:1362
BDBM50044784
NameBDBM50044784
Synonyms:CHEBI:79090 US10865384, Compound SB202190
TypeSmall organic molecule
Emp. Form.C20H14FN3O
Mol. Mass.331.3431
SMILESOc1ccc(cc1)-c1nc(c([nH]1)-c1ccncc1)-c1ccc(F)cc1