Reaction Details
TargetMitogen-activated protein kinase 11
LigandBDBM50045333
Substrate/Competitorn/a
Meas. Tech.ChEMBL_1634406 (CHEMBL3877198)
IC50 12±n/a nM
Citation Munoz, L Non-kinase targets of protein kinase inhibitors. Nat Rev Drug Discov16:424-440 (2017) 
 
Mitogen-activated protein kinase 11
Name:Mitogen-activated protein kinase 11
Type:Enzyme Catalytic Domain
Mol. Mass.:41351.73
Organism:Homo sapiens (Human)
Description:gi_20128774
Residue:364
BDBM50045333
NameBDBM50045333
Synonyms:CHEBI:90705 | SB-203580
TypeSmall organic molecule
Emp. Form.C21H16FN3OS
Mol. Mass.377.435
SMILESC[S+]([O-])c1ccc(cc1)-c1nc(c([nH]1)-c1ccncc1)-c1ccc(F)cc1