Reaction Details
TargettRNA-dihydrouridine(20) synthase [NAD(P)+]-like
LigandBDBM50210162
Substrate/Competitorn/a
Meas. Tech.ChEMBL_1634423 (CHEMBL3877215)
IC50 1600±n/a nM
Citation Munoz, L Non-kinase targets of protein kinase inhibitors. Nat Rev Drug Discov16:424-440 (2017) 
 
tRNA-dihydrouridine(20) synthase [NAD(P)+]-like
Name:tRNA-dihydrouridine(20) synthase [NAD(P)+]-like
Type:PROTEIN
Mol. Mass.:55052.74
Organism:Homo sapiens (Human)
Description:ChEMBL_116950
Residue:493
BDBM50210162
NameBDBM50210162
Synonyms:CHEMBL3883534
TypeSmall organic molecule
Emp. Form.C18H14ClFN4O2
Mol. Mass.372.781
SMILESCOc1cc2ncnc(Nc3ccc(F)c(Cl)c3)c2cc1NC(=O)C=C