Reaction Details
TargetHistone deacetylase 6
LigandBDBM50210264
Substrate/Competitorn/a
Meas. Tech.ChEMBL_1634443 (CHEMBL3877341)
IC50>100000±n/a nM
Citation Yang, EGMustafa, NTan, ECPoulsen, ARamanujulu, PMChng, WJYen, JJDymock, BW Design and Synthesis of Janus Kinase 2 (JAK2) and Histone Deacetlyase (HDAC) Bispecific Inhibitors Based on Pacritinib and Evidence of Dual Pathway Inhibition in Hematological Cell Lines. J Med Chem59:8233-62 (2016) 
 
Histone deacetylase 6
Name:Histone deacetylase 6
Type:Chromatin regulator; hydrolase; repressor
Mol. Mass.:131381.51
Organism:Homo sapiens (Human)
Description:Q9UBN7
Residue:1215
BDBM50210264
NameBDBM50210264
Synonyms:CHEMBL3893970
TypeSmall organic molecule
Emp. Form.C30H34N4O5
Mol. Mass.530.6148
SMILESOC(=O)C1CCN(CCOc2ccc3Nc4nccc(n4)-c4cccc(COC\C=C\COCc2c3)c4)CC1