Reaction Details
TargetNeuronal acetylcholine receptor subunit alpha-2/beta-4
LigandBDBM50210334
Substrate/Competitorn/a
Meas. Tech.ChEMBL_1634647 (CHEMBL3877545)
Ki 460±n/a nM
Citation Zhang, HKEaton, JBFedolak, AGunosewoyo, HOnajole, OKBrunner, DLukas, RJYu, LFKozikowski, AP Synthesis and biological evaluation of novel hybrids of highly potent and selectivea4ß2-Nicotinic acetylcholine receptor (nAChR) partial agonists. Eur J Med Chem124:689-697 (2016) 
 
Neuronal acetylcholine receptor subunit alpha-2/beta-4
Name:Neuronal acetylcholine receptor subunit alpha-2/beta-4
Type:Protein
Mol. Mass.:n/a
Description:n/a
Components:This complex has 2 components.
Component 1
Name:Neuronal acetylcholine receptor subunit alpha-2
Synonyms:ACHA2_RAT Cholinergic, Nicotinic Alpha2Beta2 Chrna2
Type:Enzyme
Mol. Mass.:58597.25
Organism:Rattus norvegicus (Rat)
Description:P12389
Residue:511
Component 2
Name:Neuronal acetylcholine receptor subunit beta-4
Synonyms:ACHB4_RAT Chrnb4 Neuronal acetylcholine receptor non-alpha-2 chain | Neuronal acetylcholine receptor protein beta-4 subunit
Type:Enzyme
Mol. Mass.:55863.89
Organism:Rattus norvegicus (Rat)
Description:P12392
Residue:495
BDBM50210334
NameBDBM50210334
Synonyms:CHEMBL3948977
TypeSmall organic molecule
Emp. Form.C16H25N3O
Mol. Mass.275.3892
SMILES[H][C@]1(CCOC)C[C@]1([H])c1cncc(c1)N1CCCNCC1