Reaction Details
TargetNeuronal acetylcholine receptor subunit alpha-3/beta-2
LigandBDBM50210336
Substrate/Competitorn/a
Meas. Tech.ChEMBL_1634648 (CHEMBL3877546)
Ki 617±n/a nM
Citation Zhang, HKEaton, JBFedolak, AGunosewoyo, HOnajole, OKBrunner, DLukas, RJYu, LFKozikowski, AP Synthesis and biological evaluation of novel hybrids of highly potent and selectivea4ß2-Nicotinic acetylcholine receptor (nAChR) partial agonists. Eur J Med Chem124:689-697 (2016) 
 
Neuronal acetylcholine receptor subunit alpha-3/beta-2
Name:Neuronal acetylcholine receptor subunit alpha-3/beta-2
Type:Protein
Mol. Mass.:n/a
Description:n/a
Components:This complex has 2 components.
Component 1
Name:Neuronal acetylcholine receptor subunit alpha-3
Synonyms:ACHA3_RAT Chrna3
Type:Enzyme
Mol. Mass.:56995.52
Organism:Rattus norvegicus (Rat)
Description:P04757
Residue:499
Component 2
Name:Neuronal acetylcholine receptor subunit beta-2
Synonyms:ACHB2_RAT Chrnb2 Neuronal acetylcholine receptor non-alpha-1 chain
Type:Enzyme
Mol. Mass.:56910.32
Organism:Rattus norvegicus (Rat)
Description:P12390
Residue:500
BDBM50210336
NameBDBM50210336
Synonyms:CHEMBL3899499
TypeSmall organic molecule
Emp. Form.C16H23N3O
Mol. Mass.273.3733
SMILES[H][C@@]1(CCOC)C[C@@]1([H])c1cncc(c1)N1C[C@]2([H])C[C@@]1([H])CN2