Reaction Details
TargetAcetylcholine receptor subunit alpha/beta/delta/gamma
LigandBDBM50210337
Substrate/Competitorn/a
Meas. Tech.ChEMBL_1634666 (CHEMBL3877564)
EC50>10000±n/a nM
Citation Zhang, HKEaton, JBFedolak, AGunosewoyo, HOnajole, OKBrunner, DLukas, RJYu, LFKozikowski, AP Synthesis and biological evaluation of novel hybrids of highly potent and selectivea4ß2-Nicotinic acetylcholine receptor (nAChR) partial agonists. Eur J Med Chem124:689-697 (2016) 
 
Acetylcholine receptor subunit alpha/beta/delta/gamma
Name:Acetylcholine receptor subunit alpha/beta/delta/gamma
Type:n/a
Mol. Mass.:n/a
Description:ASSAY_ID of EBI is 369002
Components:This complex has 4 components.
Component 1
Name:Acetylcholine receptor subunit alpha
Synonyms:ACHA_HUMAN Acetylcholine receptor protein alpha chain CHNRA Cholinergic, Nicotinic Alpha1Beta1DeltaGamma Nicotinic acetylcholine receptor alpha-1/beta-1 Nicotinic acetylcholine receptor alpha2/beta4 n-AChR
Type:Ion channel
Mol. Mass.:54542.01
Organism:Homo sapiens (Human)
Description:n/a
Residue:482
Component 2
Name:Acetylcholine receptor subunit beta
Synonyms:ACHB_HUMAN Acetylcholine receptor subunit beta CHRNB1 | Nicotinic acetylcholine receptor alpha-1/beta-1/delta/epsilon
Type:PROTEIN
Mol. Mass.:56691.23
Organism:Homo sapiens (Human)
Description:EBI_10924
Residue:501
Component 3
Name:Acetylcholine receptor subunit gamma
Synonyms:ACHG_HUMAN Acetylcholine receptor subunit gamma Muscle-type nicotinic acetylcholine receptor
Type:PROTEIN
Mol. Mass.:57880.69
Organism:Homo sapiens (Human)
Description:EBI_11211
Residue:517
Component 4
Name:Acetylcholine receptor subunit delta
Synonyms:ACHD_HUMAN Acetylcholine receptor protein delta chain Muscle-type nicotinic acetylcholine receptor | Nicotinic acetylcholine receptor alpha-1/beta-1/delta/epsilon
Type:PROTEIN
Mol. Mass.:58894.39
Organism:Homo sapiens (Human)
Description:ChEMBL_142595
Residue:517
BDBM50210337
NameBDBM50210337
Synonyms:CHEMBL3970672
TypeSmall organic molecule
Emp. Form.C15H20N4O2
Mol. Mass.288.3449
SMILESOCCc1cc(on1)-c1cncc(c1)N1CCCNCC1