Reaction Details
TargetNeuronal acetylcholine receptor subunit alpha-4/beta-2
LigandBDBM50210337
Substrate/Competitorn/a
Meas. Tech.ChEMBL_1634654 (CHEMBL3877552)
EC50 31±n/a nM
Citation Zhang, HKEaton, JBFedolak, AGunosewoyo, HOnajole, OKBrunner, DLukas, RJYu, LFKozikowski, AP Synthesis and biological evaluation of novel hybrids of highly potent and selectivea4ß2-Nicotinic acetylcholine receptor (nAChR) partial agonists. Eur J Med Chem124:689-697 (2016) 
 
Neuronal acetylcholine receptor subunit alpha-4/beta-2
Name:Neuronal acetylcholine receptor subunit alpha-4/beta-2
Type:Protein
Mol. Mass.:n/a
Description:n/a
Components:This complex has 2 components.
Component 1
Name:Neuronal acetylcholine receptor subunit alpha-4
Synonyms:ACHA4_HUMAN CHRNA4 protein Neuronal acetylcholine receptor protein alpha-4 subunit Nicotinic acetylcholine receptor alpha4/beta2/alpha5
Type:n/a
Mol. Mass.:69963.49
Organism:Homo sapiens (Human)
Description:NACHRA4
Residue:627
Component 2
Name:Neuronal acetylcholine receptor subunit beta-2
Synonyms:ACHB2_HUMAN Neuronal acetylcholine receptor protein beta-2 subunit | Nicotinic acetylcholine receptor alpha3/beta2/alpha5
Type:Protein
Mol. Mass.:57020.50
Organism:Homo sapiens (Human)
Description:P17787
Residue:502
BDBM50210337
NameBDBM50210337
Synonyms:CHEMBL3970672
TypeSmall organic molecule
Emp. Form.C15H20N4O2
Mol. Mass.288.3449
SMILESOCCc1cc(on1)-c1cncc(c1)N1CCCNCC1