Reaction Details
TargetReceptor tyrosine-protein kinase erbB-2
LigandBDBM50210878
Substrate/Competitorn/a
Meas. Tech.ChEMBL_1635517 (CHEMBL3878415)
Kd 172±n/a nM
Citation Pallerla, SGauthier, TSable, RJois, SD Design of a doxorubicin-peptidomimetic conjugate that targets HER2-positive cancer cells. Eur J Med Chem125:914-924 (2017) 
 
Receptor tyrosine-protein kinase erbB-2
Name:Receptor tyrosine-protein kinase erbB-2
Type:n/a
Mol. Mass.:137894.47
Organism:Homo sapiens (Human)
Description:P04626
Residue:1255
BDBM50210878
NameBDBM50210878
Synonyms:CHEMBL3985782
TypeSmall organic molecule
Emp. Form.C60H67N7O17
Mol. Mass.1158.2107
SMILES[H][C@@]1(C[C@@](O)(Cc2c(O)c3C(=O)c4cccc(OC)c4C(=O)c3c(O)c12)C(=O)CO)O[C@H]1C[C@H](NC(=O)CCCC(=O)N[C@@H](CCCNC(N)=N)C(=O)N[C@@H](CC(=O)N[C@@H](Cc2ccccc2)C(O)=O)c2cccc3ccccc23)[C@H](O)[C@H](C)O1