Reaction Details
TargetPhosphatidylinositol 4,5-bisphosphate 3-kinase catalytic subunit alpha isoform
LigandBDBM74255
Substrate/Competitorn/a
Meas. Tech.ChEMBL_1636717 (CHEMBL3879615)
IC50 20000±n/a nM
Citation Miller, MSMaheshwari, SMcRobb, FMKinzler, KWAmzel, LMVogelstein, BGabelli, SB Identification of allosteric binding sites for PI3Ka oncogenic mutant specific inhibitor design. Bioorg Med Chem25:1481-1486 (2017) 
 
Phosphatidylinositol 4,5-bisphosphate 3-kinase catalytic subunit alpha isoform
Name:Phosphatidylinositol 4,5-bisphosphate 3-kinase catalytic subunit alpha isoform
Type:Enzyme Subunit
Mol. Mass.:124294.87
Organism:Homo sapiens (Human)
Description:P42336
Residue:1068
BDBM74255
NameBDBM74255
Synonyms:(3-amino-2-methyl-phenyl)amine 2-methylbenzene-1,3-diamine SMR001261423 | cid_13205
TypeSmall organic molecule
Emp. Form.C7H10N2
Mol. Mass.122.1677
SMILESCc1c(N)cccc1N