Reaction Details
TargetAcyl-protein thioesterase 2
LigandBDBM50212217
Substrate/Competitorn/a
Meas. Tech.ChEMBL_1636766 (CHEMBL3879664)
Ki>10000±n/a nM
Citation Won, SJEschweiler, JDMajmudar, JDChong, FSHwang, SYRuotolo, BTMartin, BR Affinity-Based Selectivity Profiling of an In-Class Selective Competitive Inhibitor of Acyl Protein Thioesterase 2. ACS Med Chem Lett8:215-220 (2017) 
 
Acyl-protein thioesterase 2
Name:Acyl-protein thioesterase 2
Type:Protein
Mol. Mass.:24740.23
Organism:Homo sapiens (Human)
Description:O95372
Residue:231
BDBM50212217
NameBDBM50212217
Synonyms:CHEMBL3917640
TypeSmall organic molecule
Emp. Form.C43H54N8O9S3
Mol. Mass.923.132
SMILES[H][C@]12CS[C@@H](CCCCC(=O)NCCOCCOCCOCCn3cc(COc4ccccc4N4CCN(CC4)C(=O)c4cc5CS(=O)(=O)c6ccccc6-c5s4)nn3)[C@@]1([H])NC(=O)N2