Reaction Details
TargetPyridoxal kinase
LigandBDBM207992
Substrate/Competitorn/a
Meas. Tech.ChEMBL_1636780 (CHEMBL3879678)
IC50>10000±n/a nM
Citation Won, SJEschweiler, JDMajmudar, JDChong, FSHwang, SYRuotolo, BTMartin, BR Affinity-Based Selectivity Profiling of an In-Class Selective Competitive Inhibitor of Acyl Protein Thioesterase 2. ACS Med Chem Lett8:215-220 (2017) 
 
Pyridoxal kinase
Name:Pyridoxal kinase
Type:PROTEIN
Mol. Mass.:35099.40
Organism:Homo sapiens (Human)
Description:ChEMBL_103125
Residue:312
BDBM207992
NameBDBM207992
Synonyms:ML349
TypeSmall organic molecule
Emp. Form.C23H22N2O4S2
Mol. Mass.454.562
SMILESCOc1ccc(cc1)N1CCN(CC1)C(=O)c1cc2CS(=O)(=O)c3ccccc3-c2s1