Reaction Details
TargetPyridoxal kinase
LigandBDBM50212216
Substrate/Competitorn/a
Meas. Tech.ChEMBL_1636780 (CHEMBL3879678)
IC50>10000±n/a nM
Citation Won, SJEschweiler, JDMajmudar, JDChong, FSHwang, SYRuotolo, BTMartin, BR Affinity-Based Selectivity Profiling of an In-Class Selective Competitive Inhibitor of Acyl Protein Thioesterase 2. ACS Med Chem Lett8:215-220 (2017) 
 
Pyridoxal kinase
Name:Pyridoxal kinase
Type:PROTEIN
Mol. Mass.:35099.40
Organism:Homo sapiens (Human)
Description:ChEMBL_103125
Residue:312
BDBM50212216
NameBDBM50212216
Synonyms:CHEMBL3944678
TypeSmall organic molecule
Emp. Form.C43H54N8O9S3
Mol. Mass.923.132
SMILES[H][C@]12CS[C@@H](CCCCC(=O)NCCOCCOCCOCCn3cc(COc4ccc(cc4)N4CCN(CC4)C(=O)c4cc5CS(=O)(=O)c6ccccc6-c5s4)nn3)[C@@]1([H])NC(=O)N2