Reaction Details
TargetSodium channel protein type 9 subunit alpha
LigandBDBM50212224
Substrate/Competitorn/a
Meas. Tech.ChEMBL_1636811 (CHEMBL3879709)
IC50 1.3±n/a nM
Citation Blass, B Bicyclic Ketone Sulfonamide Compounds. ACS Med Chem Lett8:278-280 (2017) 
 
Sodium channel protein type 9 subunit alpha
Name:Sodium channel protein type 9 subunit alpha
Type:Protein
Mol. Mass.:226375.97
Organism:Homo sapiens (Human)
Description:Q15858
Residue:1988
BDBM50212224
NameBDBM50212224
Synonyms:CHEMBL3949548
TypeSmall organic molecule
Emp. Form.C26H20ClF4N5O5S
Mol. Mass.625.979
SMILESCOc1cc(c(F)cc1-n1c2CCN(Cc2ccc1=O)S(=O)(=O)Nc1cccnn1)-c1cc(Cl)cc(OC(F)(F)F)c1