Reaction Details
TargetVoltage-dependent L-type calcium channel subunit alpha-1S
LigandBDBM50029417
Substrate/Competitorn/a
Meas. Tech.ChEMBL_42936 (CHEMBL654578)
IC50 0.420000±n/a nM
Citation  TBA Bioorg Med Chem Lett2:1193-1198 (1992)  
 
Voltage-dependent L-type calcium channel subunit alpha-1S
Name:Voltage-dependent L-type calcium channel subunit alpha-1S
Type:PROTEIN
Mol. Mass.:210392.58
Organism:Rattus norvegicus
Description:ChEMBL_92777
Residue:1850
BDBM50029417
NameBDBM50029417
Synonyms:CHEMBL277363 | [4-(4-Methoxy-phenyl)-4H-benzo[b]pyrrolo[1,2-d][1,4]thiazin-1-ylmethyl]-dimethyl-amine
TypeSmall organic molecule
Emp. Form.C21H22N2OS
Mol. Mass.350.477
SMILESCOc1ccc(cc1)C1Sc2ccccc2-n2c(CN(C)C)ccc12