Reaction Details
TargetcAMP-dependent protein kinase catalytic subunit gamma
LigandBDBM50280450
Substrate/Competitorn/a
Meas. Tech.ChEMBL_161896 (CHEMBL772605)
IC50 250±n/a nM
Citation  TBA Bioorg Med Chem Lett2:449-452 (1992)  
 
cAMP-dependent protein kinase catalytic subunit gamma
Name:cAMP-dependent protein kinase catalytic subunit gamma
Type:PROTEIN
Mol. Mass.:40442.03
Organism:Homo sapiens (Human)
Description:ChEMBL_104720
Residue:351
BDBM50280450
NameBDBM50280450
Synonyms:18-hydroxy-3-methoxy-2-methyl-4-methylamino-(2R,3S,4S,6S)-29-oxa-1,7,17-triazaoctacyclo[12.12.2.12,6.07,28.08,13.015,19.020,27.021,26]nonacosa-8(13),9,11,14(28),15(19),20(27),21(26),22,24-nonaen-16-one UCN-01 | UCN-02
TypeSmall organic molecule
Emp. Form.C28H26N4O4
Mol. Mass.482.5304
SMILESCN[C@@H]1C[C@H]2O[C@@](C)([C@@H]1OC)n1c3ccccc3c3c4[C@H](O)NC(=O)c4c4c5ccccc5n2c4c13