Reaction Details
TargetBeta-lactamase SHV-1
LigandBDBM50212643
Substrate/Competitorn/a
Meas. Tech.ChEMBL_40707 (CHEMBL654919)
IC50 141±n/a nM
Citation  TBA Bioorg Med Chem Lett3:2247-2252 (1993)  
 
Beta-lactamase SHV-1
Name:Beta-lactamase SHV-1
Type:Protein
Mol. Mass.:31226.68
Organism:Klebsiella pneumoniae (Enterobacteria)
Description:4R3B
Residue:286
BDBM50212643
NameBDBM50212643
Synonyms:CHEMBL308516
TypeSmall organic molecule
Emp. Form.C15H13BrN2O3S3
Mol. Mass.445.374
SMILES[H][C@]12S[C@@](C)(CSc3nc4ccccc4s3)[C@@H](N1C(=O)[C@H]2Br)C(O)=O