Reaction Details
TargetBeta-lactamase SHV-1
LigandBDBM50212642
Substrate/Competitorn/a
Meas. Tech.ChEMBL_40707 (CHEMBL654919)
IC50 146±n/a nM
Citation  TBA Bioorg Med Chem Lett3:2247-2252 (1993)  
 
Beta-lactamase SHV-1
Name:Beta-lactamase SHV-1
Type:Protein
Mol. Mass.:31226.68
Organism:Klebsiella pneumoniae (Enterobacteria)
Description:4R3B
Residue:286
BDBM50212642
NameBDBM50212642
Synonyms:CHEMBL70269
TypeSmall organic molecule
Emp. Form.C15H13BrN2O4S2
Mol. Mass.429.309
SMILES[H][C@]12S[C@@](C)(CSc3nc4ccccc4o3)[C@@H](N1C(=O)[C@H]2Br)C(O)=O