Reaction Details
TargetBeta-lactamase SHV-1
LigandBDBM50212641
Substrate/Competitorn/a
Meas. Tech.ChEMBL_40707 (CHEMBL654919)
IC50 17.8±n/a nM
Citation  TBA Bioorg Med Chem Lett3:2247-2252 (1993)  
 
Beta-lactamase SHV-1
Name:Beta-lactamase SHV-1
Type:Protein
Mol. Mass.:31226.68
Organism:Klebsiella pneumoniae (Enterobacteria)
Description:4R3B
Residue:286
BDBM50212641
NameBDBM50212641
Synonyms:Brobactam
TypeSmall organic molecule
Emp. Form.C8H10BrNO3S
Mol. Mass.280.139
SMILES[H][C@]12SC(C)(C)[C@@H](N1C(=O)[C@H]2Br)C(O)=O