Reaction Details
TargetBeta-lactamase
LigandBDBM50212644
Substrate/Competitorn/a
Meas. Tech.ChEMBL_40871 (CHEMBL653625)
IC50 1600±n/a nM
Citation  TBA Bioorg Med Chem Lett3:2247-2252 (1993)  
 
Beta-lactamase
Name:Beta-lactamase
Type:PROTEIN
Mol. Mass.:31149.65
Organism:Klebsiella oxytoca
Description:ChEMBL_101264
Residue:290
BDBM50212644
NameBDBM50212644
Synonyms:CHEMBL73450
TypeSmall organic molecule
Emp. Form.C12H14BrN3O3S2
Mol. Mass.392.292
SMILES[H][C@]12S[C@@](C)(CSc3nccn3C)[C@@H](N1C(=O)[C@H]2Br)C(O)=O