Reaction Details
TargetBeta-lactamase BRO-1
LigandBDBM50021954
Substrate/Competitorn/a
Meas. Tech.ChEMBL_40225 (CHEMBL653998)
IC50 107±n/a nM
Citation  TBA Bioorg Med Chem Lett3:2247-2252 (1993)  
 
Beta-lactamase BRO-1
Name:Beta-lactamase BRO-1
Type:PROTEIN
Mol. Mass.:35383.81
Organism:Moraxella catarrhalis
Description:ChEMBL_104100
Residue:313
BDBM50021954
NameBDBM50021954
Synonyms:(2S,5R)-3,3-Dimethyl-4,4,7-trioxo-4lambda*6*-thia-1-aza-bicyclo[3.2.0]heptane-2-carboxylic acid 3,3-Dimethyl-4,4,7-trioxo-4lambda*6*-thia-1-aza-bicyclo[3.2.0]heptane-2-carboxylic acid CHEMBL403 SULBACTAM US20230322715, Compound ALK-09 | US9120808, Sulbactam sodium salt
TypeSmall organic molecule
Emp. Form.C8H11NO5S
Mol. Mass.233.242
SMILESCC1(C)[C@@H](N2[C@@H](CC2=O)S1(=O)=O)C(O)=O