Reaction Details
TargetPancreatic triacylglycerol lipase
LigandBDBM50212746
Substrate/Competitorn/a
Meas. Tech.ChEMBL_158243 (CHEMBL762425)
Ki 5700±n/a nM
KOFF 5700.000000 s-1
Citation  TBA Bioorg Med Chem Lett3:357-358 (1993)  
 
Pancreatic triacylglycerol lipase
Name:Pancreatic triacylglycerol lipase
Type:PROTEIN
Mol. Mass.:51157.75
Organism:Homo sapiens (Human)
Description:ChEMBL_527250
Residue:465
BDBM50212746
NameBDBM50212746
Synonyms:CHEMBL119630
TypeSmall organic molecule
Emp. Form.C11H16O2
Mol. Mass.180.2435
SMILES[H][C@]12C[C@@H](OC(=O)CCC)[C@@]1([H])CC=C2