Reaction Details
TargetBeta-1/Beta-2/Beta-3 adrenergic receptor
LigandBDBM50212977
Substrate/Competitorn/a
Meas. Tech.ChEMBL_39352 (CHEMBL654959)
EC50>30000±n/a nM
Citation  TBA Bioorg Med Chem Lett4:1921-1924 (1994)  
 
Beta-1/Beta-2/Beta-3 adrenergic receptor
Name:Beta-1/Beta-2/Beta-3 adrenergic receptor
Synonyms:Adrenergic receptor beta
Type:n/a
Mol. Mass.:n/a
Description:ASSAY_ID of ChEMBL is 305577
Components:This complex has 3 components.
Component 1
Name:Beta-2 adrenergic receptor
Type:n/a
Mol. Mass.:46461.69
Organism:Homo sapiens (Human)
Description:P07550
Residue:413
Component 2
Name:Beta-1 adrenergic receptor
Synonyms:ADRB1 ADRB1_HUMAN Beta-1 adrenoceptor adrenergic Beta1
Type:G Protein-Coupled Receptor (GPCR)
Mol. Mass.:51338.40
Organism:Homo sapiens (Human)
Description:P08588
Residue:477
Component 3
Name:Beta-3 adrenergic receptor
Synonyms:ADRB3 ADRB3_HUMAN Beta-2 adrenergic receptor and beta-3 adrenergic receptor Beta-3 adrenoreceptor | adrenergic Beta3
Type:G Protein-Coupled Receptor (GPCR)
Mol. Mass.:43534.88
Organism:Homo sapiens (Human)
Description:n/a
Residue:408
BDBM50212977
NameBDBM50212977
Synonyms:AMIBEGRON HYDROCHLORIDE SR-58611A
TypeSmall organic molecule
Emp. Form.C22H27Cl2NO4
Mol. Mass.440.36
SMILESCl.CCOC(=O)COc1ccc2CC[C@@H](Cc2c1)NC[C@H](O)c1cccc(Cl)c1