Reaction Details
TargetBeta-1/Beta-2/Beta-3 adrenergic receptor
LigandBDBM50212980
Substrate/Competitorn/a
Meas. Tech.ChEMBL_39355 (CHEMBL654961)
IC50 319±n/a nM
Citation  TBA Bioorg Med Chem Lett4:1921-1924 (1994)  
 
Beta-1/Beta-2/Beta-3 adrenergic receptor
Name:Beta-1/Beta-2/Beta-3 adrenergic receptor
Synonyms:Adrenergic receptor beta
Type:n/a
Mol. Mass.:n/a
Description:ASSAY_ID of ChEMBL is 1340543
Components:This complex has 3 components.
Component 1
Name:Beta-1 adrenergic receptor
Type:Protein
Mol. Mass.:50486.84
Organism:Rattus norvegicus (Rat)
Description:P18090
Residue:466
Component 2
Name:Beta-2 adrenergic receptor
Synonyms:ADRB2_RAT Adrb2r | Adrenergic receptor beta
Type:PROTEIN
Mol. Mass.:46896.26
Organism:Rattus norvegicus
Description:ChEMBL_38603
Residue:418
Component 3
Name:Beta-3 adrenergic receptor
Synonyms:ADRB3_RAT Adrb3r Beta-3 adrenergic receptor
Type:PROTEIN
Mol. Mass.:43161.83
Organism:Rattus norvegicus
Description:ChEMBL_1509452
Residue:400
BDBM50212980
NameBDBM50212980
Synonyms:CHEMBL553039 | SR-58997A
TypeSmall organic molecule
Emp. Form.C23H29Cl2NO3
Mol. Mass.438.387
SMILESCl.CCOC(=O)CCc1ccc2CC[C@@H](Cc2c1)NC[C@H](O)c1cccc(Cl)c1