Reaction Details
TargetAlpha-2A adrenergic receptor
LigandBDBM50212993
Substrate/Competitorn/a
Meas. Tech.ChEMBL_33088 (CHEMBL643580)
EC50 38±n/a nM
Citation  TBA Bioorg Med Chem Lett4:2317-2322 (1994)  
 
Alpha-2A adrenergic receptor
Name:Alpha-2A adrenergic receptor
Type:Enzyme
Mol. Mass.:48979.91
Organism:Homo sapiens (Human)
Description:P08913
Residue:465
BDBM50212993
NameBDBM50212993
Synonyms:CHEMBL305928
TypeSmall organic molecule
Emp. Form.C10H18N2O
Mol. Mass.182.2627
SMILESC1CN=C(NC2CCCCCC2)O1