Reaction Details
TargetPBP2A
LigandBDBM50213263
Substrate/Competitorn/a
Meas. Tech.ChEMBL_153662 (CHEMBL757854)
IC50 1.06e+04±n/a nM
Citation  TBA Bioorg Med Chem Lett5:1427-1432 (1995)  
 
PBP2A
Name:PBP2A
Type:PROTEIN
Mol. Mass.:76283.66
Organism:Staphylococcus aureus
Description:ChEMBL_105733
Residue:668
BDBM50213263
NameBDBM50213263
Synonyms:CHEMBL284058
TypeSmall organic molecule
Emp. Form.C19H19N2NaO5S2
Mol. Mass.442.484
SMILES[Na+].[H][C@]12[C@@H](C)C(Sc3nc4ccc(OCC)cc4s3)=C(N1C(=O)[C@]2([H])[C@@H](C)O)C([O-])=O